Target
Serine/threonine-protein kinase Nek2
Ligand
BDBM2579
Substrate
Meas. Tech.
ChEMBL_1284301 (CHEMBL3108322)
IC50
4790±n/a nM
Citation
 El Amrani, MLai, DDebbab, AAly, AHSiems, KSeidel, CSchnekenburger, MGaigneaux, ADiederich, MFeger, DLin, WProksch, P Protein kinase and HDAC inhibitors from the endophytic fungus Epicoccum nigrum. J Nat Prod 77:49-56 (2014)  
Target
Name:
Serine/threonine-protein kinase Nek2
Synonyms:
NEK kinase NEK2A NLK1
Type:
Enzyme
Mol. Mass.:
51776.96
Organism:
Homo sapiens (Human)
Description:
P51955
Residue:
445
  
Inhibitor
Name:
BDBM2579
Synonyms:
(2S,3R,4R,6R)-3-methoxy-2-methyl-4-(methylamino)-29-oxa-1,7,17-triazaoctacyclo[12.12.2.1^{2,6}.0^{7,28}.0^{8,13}.0^{15,19}.0^{20,27}.0^{21,26}]nonacosa-8(13),9,11,14(28),15(19),20(27),21(26),22,24-nonaen-16-one Staurosporin, 4 Staurosporine, 8 US9206188, Staurosporine | US9226923, Staurosporine
Type:
Small organic molecule
Emp. Form.:
C28H26N4O3
Mol. Mass.:
466.531
SMILES:
CN[C@@H]1C[C@H]2O[C@@](C)([C@@H]1OC)n1c3ccccc3c3c4CNC(=O)c4c4c5ccccc5n2c4c13
: