Target
Serine/threonine-protein kinase Nek2
Ligand
BDBM50445474
Substrate
Meas. Tech.
ChEMBL_1284301 (CHEMBL3108322)
IC50
3780±n/a nM
Citation
 El Amrani, MLai, DDebbab, AAly, AHSiems, KSeidel, CSchnekenburger, MGaigneaux, ADiederich, MFeger, DLin, WProksch, P Protein kinase and HDAC inhibitors from the endophytic fungus Epicoccum nigrum. J Nat Prod 77:49-56 (2014)  
Target
Name:
Serine/threonine-protein kinase Nek2
Synonyms:
NEK kinase NEK2A NLK1
Type:
Enzyme
Mol. Mass.:
51776.96
Organism:
Homo sapiens (Human)
Description:
P51955
Residue:
445
  
Inhibitor
Name:
BDBM50445474
Synonyms:
CHEMBL3104855
Type:
Small organic molecule
Emp. Form.:
C18H14O8
Mol. Mass.:
358.299
SMILES:
Cc1c(O)c(O)c2oc(cc2c1C=O)-c1c(C)c(O)c(O)c(O)c1C=O
: