Target
Glucose-dependent insulinotropic receptor
Ligand
BDBM50445482
Substrate
Meas. Tech.
ChEMBL_1284646 (CHEMBL3107227)
EC50
493±n/a nM
Citation
 Yu, MKen Zhang, JWang, YZhu, JKayser, FMedina, JCSiegler, KConn, MShan, BGrillo, MPCoward, PJim Liu, J Discovery and optimization of N-(3-(1,3-dioxo-2,3-dihydro-1H-pyrrolo[3,4-c]pyridin-4-yloxy)phenyl)benzenesulfonamides as novel GPR119 agonists. Bioorg Med Chem Lett 24:156-60 (2013)  
Target
Name:
Glucose-dependent insulinotropic receptor
Synonyms:
G-protein coupled receptor 119 (GPR119) GPR119 | Glucose-dependent insulinotropic receptor
Type:
Protein
Mol. Mass.:
36901.49
Organism:
Homo sapiens (Human)
Description:
Q8TDV5
Residue:
335
  
Inhibitor
Name:
BDBM50445482
Synonyms:
CHEMBL3104862
Type:
Small organic molecule
Emp. Form.:
C23H19ClFN3O5S
Mol. Mass.:
503.93
SMILES:
CC(C)N1C(=O)c2cc(C)nc(Oc3cccc(NS(=O)(=O)c4ccc(Cl)cc4)c3F)c2C1=O
: