Target
Glucose-dependent insulinotropic receptor
Ligand
BDBM50445499
Substrate
Meas. Tech.
ChEMBL_1284646 (CHEMBL3107227)
EC50
19±n/a nM
Citation
 Yu, MKen Zhang, JWang, YZhu, JKayser, FMedina, JCSiegler, KConn, MShan, BGrillo, MPCoward, PJim Liu, J Discovery and optimization of N-(3-(1,3-dioxo-2,3-dihydro-1H-pyrrolo[3,4-c]pyridin-4-yloxy)phenyl)benzenesulfonamides as novel GPR119 agonists. Bioorg Med Chem Lett 24:156-60 (2013)  
Target
Name:
Glucose-dependent insulinotropic receptor
Synonyms:
G-protein coupled receptor 119 (GPR119) GPR119 | Glucose-dependent insulinotropic receptor
Type:
Protein
Mol. Mass.:
36901.49
Organism:
Homo sapiens (Human)
Description:
Q8TDV5
Residue:
335
  
Inhibitor
Name:
BDBM50445499
Synonyms:
CHEMBL3104888
Type:
Small organic molecule
Emp. Form.:
C23H18ClN3O6S
Mol. Mass.:
499.924
SMILES:
COc1cc2C(=O)N(C3CC3)C(=O)c2c(Oc2cccc(NS(=O)(=O)c3ccc(Cl)cc3)c2)n1
: