Target
Glucose-dependent insulinotropic receptor
Ligand
BDBM50343449
Substrate
Meas. Tech.
ChEMBL_1284646 (CHEMBL3107227)
EC50
41±n/a nM
Citation
 Yu, MKen Zhang, JWang, YZhu, JKayser, FMedina, JCSiegler, KConn, MShan, BGrillo, MPCoward, PJim Liu, J Discovery and optimization of N-(3-(1,3-dioxo-2,3-dihydro-1H-pyrrolo[3,4-c]pyridin-4-yloxy)phenyl)benzenesulfonamides as novel GPR119 agonists. Bioorg Med Chem Lett 24:156-60 (2013)  
Target
Name:
Glucose-dependent insulinotropic receptor
Synonyms:
G-protein coupled receptor 119 (GPR119) GPR119 | Glucose-dependent insulinotropic receptor
Type:
Protein
Mol. Mass.:
36901.49
Organism:
Homo sapiens (Human)
Description:
Q8TDV5
Residue:
335
  
Inhibitor
Name:
BDBM50343449
Synonyms:
CHEMBL1775171 | isopropyl 4-(1-(4-(methylsulfonyl)phenyl)-1H-pyrazolo[3,4-d]pyrimidin-4-yloxy)piperidine-1-carboxylate
Type:
Small organic molecule
Emp. Form.:
C21H25N5O5S
Mol. Mass.:
459.519
SMILES:
CC(C)OC(=O)N1CCC(CC1)Oc1ncnc2n(ncc12)-c1ccc(cc1)S(C)(=O)=O
: