Target
Glucose-dependent insulinotropic receptor
Ligand
BDBM50445481
Substrate
Meas. Tech.
ChEMBL_1284509 (CHEMBL3106557)
EC50
2050±n/a nM
Citation
 Yu, MKen Zhang, JWang, YZhu, JKayser, FMedina, JCSiegler, KConn, MShan, BGrillo, MPCoward, PJim Liu, J Discovery and optimization of N-(3-(1,3-dioxo-2,3-dihydro-1H-pyrrolo[3,4-c]pyridin-4-yloxy)phenyl)benzenesulfonamides as novel GPR119 agonists. Bioorg Med Chem Lett 24:156-60 (2013)  
Target
Name:
Glucose-dependent insulinotropic receptor
Synonyms:
GP119_RAT | Gpr119
Type:
PROTEIN
Mol. Mass.:
51687.59
Organism:
Rattus norvegicus
Description:
ChEMBL_1506411
Residue:
468
  
Inhibitor
Name:
BDBM50445481
Synonyms:
CHEMBL3104879
Type:
Small organic molecule
Emp. Form.:
C23H19ClFN3O5S
Mol. Mass.:
503.93
SMILES:
CC(C)N1C(=O)c2cc(C)nc(Oc3cc(NS(=O)(=O)c4ccc(Cl)cc4)ccc3F)c2C1=O
: