Target
Histamine H2 receptor
Ligand
BDBM50403559
Substrate
Meas. Tech.
ChEMBL_1283829 (CHEMBL3106116)
Ki
70±n/a nM
Citation
 Rajagopalan, RBandyopadhyaya, ARajagopalan, DRRajagopalan, P The synthesis and comparative receptor binding affinities of novel, isomeric pyridoindolobenzazepine scaffolds. Bioorg Med Chem Lett 24:576-9 (2014)  
Target
Name:
Histamine H2 receptor
Synonyms:
Gastric receptor I HISTAMINE H2 HRH2_HUMAN Histamine H2-Gs alpha S
Type:
G Protein-Coupled Receptor (GPCR)
Mol. Mass.:
40115.31
Organism:
Homo sapiens (Human)
Description:
Residue:
359
  
Inhibitor
Name:
BDBM50403559
Synonyms:
Brumetadina | CIMETIDINE
Type:
Small organic molecule
Emp. Form.:
C10H16N6S
Mol. Mass.:
252.339
SMILES:
CNC(NCCSCc1[nH]cnc1C)=NC#N
: