Target
5-hydroxytryptamine receptor 3A
Ligand
BDBM50445615
Substrate
Meas. Tech.
ChEMBL_1283847 (CHEMBL3106134)
Ki
>10000±n/a nM
Citation
 Rajagopalan, RBandyopadhyaya, ARajagopalan, DRRajagopalan, P The synthesis and comparative receptor binding affinities of novel, isomeric pyridoindolobenzazepine scaffolds. Bioorg Med Chem Lett 24:576-9 (2014)  
Target
Name:
5-hydroxytryptamine receptor 3A
Synonyms:
5-HT-3 5-HT3A 5-hydroxytryptamine receptor 3 (5-HT3) 5-hydroxytryptamine receptor 3A (5HT3A) 5HT3R HTR3A Serotonin 3 receptor (5HT3) Serotonin-gated ion channel receptor | Serotonin-gated ion channel receptor 3
Type:
Protein
Mol. Mass.:
55283.27
Organism:
Homo sapiens (Human)
Description:
P46098
Residue:
478
  
Inhibitor
Name:
BDBM50445615
Synonyms:
CHEMBL3104092
Type:
Small organic molecule
Emp. Form.:
C20H20N2
Mol. Mass.:
288.3862
SMILES:
CN1CCc2c(C1)c1cccc3Cc4ccccc4Cn2c13
: