Target
D(2) dopamine receptor
Ligand
BDBM50445616
Substrate
Meas. Tech.
ChEMBL_1283842 (CHEMBL3106129)
Ki
835±n/a nM
Citation
 Rajagopalan, RBandyopadhyaya, ARajagopalan, DRRajagopalan, P The synthesis and comparative receptor binding affinities of novel, isomeric pyridoindolobenzazepine scaffolds. Bioorg Med Chem Lett 24:576-9 (2014)  
Target
Name:
D(2) dopamine receptor
Synonyms:
D(2) dopamine receptor DOPAMINE D2 Long DRD2 Dopamine D2 receptor Dopamine D2 receptor (D2R) Dopamine2-like | d2
Type:
Cell-surface receptors
Mol. Mass.:
50647.10
Organism:
Homo sapiens (Human)
Description:
P14416
Residue:
443
  
Inhibitor
Name:
BDBM50445616
Synonyms:
CHEMBL3104091
Type:
Small organic molecule
Emp. Form.:
C20H20N2
Mol. Mass.:
288.3862
SMILES:
CN1CCc2c(C1)c1cccc3CCc4ccccc4-n2c13
: