Target
P2X purinoceptor 4
Ligand
BDBM50446068
Substrate
Meas. Tech.
ChEMBL_1283892 (CHEMBL3106505)
IC50
7780±n/a nM
Citation
 Tian, MAbdelrahman, AWeinhausen, SHinz, SWeyer, SDosa, SEl-Tayeb, AMüller, CE Carbamazepine derivatives with P2X4 receptor-blocking activity. Bioorg Med Chem 22:1077-88 (2014)  
Target
Name:
P2X purinoceptor 4
Synonyms:
ATP receptor P2RX4_HUMAN Purinergic receptor | Purinergic, P2X4
Type:
Enzyme Catalytic Domain
Mol. Mass.:
43374.70
Organism:
Homo sapiens (Human)
Description:
Purinergic, P2X4 0 HUMAN::Q99571
Residue:
388
  
Inhibitor
Name:
BDBM50446068
Synonyms:
CHEMBL3103375
Type:
Small organic molecule
Emp. Form.:
C21H24N2O
Mol. Mass.:
320.4281
SMILES:
CCCN(CCC)C(=O)N1c2ccccc2C=Cc2ccccc12
: