Target
Plasmepsin II
Ligand
BDBM50446323
Substrate
Meas. Tech.
ChEMBL_1286909 (CHEMBL3110823)
IC50
12±n/a nM
Citation
 Meyers, MJTortorella, MDXu, JQin, LHe, ZLang, XZeng, WXu, WQin, LPrinsen, MJSverdrup, FMEickhoff, CSGriggs, DWOliva, JRuminski, PGJacobsen, EJCampbell, MAWood, DCGoldberg, DELiu, XLu, YLu, XTu, ZLu, XDing, KChen, X Evaluation of aminohydantoins as a novel class of antimalarial agents. ACS Med Chem Lett 5:89-93 (2014)  
Target
Name:
Plasmepsin II
Synonyms:
Aspartic hemoglobinase II PLM2_PLAFX Plasmepsin 2 Plasmepsin-II
Type:
Enzyme
Mol. Mass.:
51482.09
Organism:
Plasmodium falciparum
Description:
P46925
Residue:
453
  
Inhibitor
Name:
BDBM50446323
Synonyms:
CHEMBL588662
Type:
Small organic molecule
Emp. Form.:
C25H25N3O
Mol. Mass.:
383.4855
SMILES:
CCC(CN1C(=N)NC(C1=O)(c1ccccc1)c1ccccc1)c1ccccc1
: