Target
C-X-C chemokine receptor type 3
Ligand
BDBM50358609
Substrate
Meas. Tech.
ChEMBL_1290437 (CHEMBL3119548)
IC50
0.800000±n/a nM
Citation
 Nair, AGWong, MKShu, YJiang, YJenh, CHKim, SHYang, DYZeng, QShao, YZawacki, LGDuo, JMcGuinness, BFCarroll, CDHobbs, DWShih, NYRosenblum, SBKozlowski, JA IV. Discovery of CXCR3 antagonists substituted with heterocycles as amide surrogates: improved PK, hERG and metabolic profiles. Bioorg Med Chem Lett 24:1085-8 (2014)  
Target
Name:
C-X-C chemokine receptor type 3
Synonyms:
AAO92295.1 C-X-C chemokine receptor type 3 (CXCR3) CXCR3 CXCR3_HUMAN chemokine (C-X-C motif) receptor 3
Type:
Enzyme Catalytic Domain
Mol. Mass.:
40665.65
Organism:
Homo sapiens (Human)
Description:
Residue:
368
  
Inhibitor
Name:
BDBM50358609
Synonyms:
CHEMBL1921858
Type:
Small organic molecule
Emp. Form.:
C23H31Cl2N7O
Mol. Mass.:
492.445
SMILES:
CC[C@H]1CN(CCN1C1CCN(Cc2ccc(Cl)cc2)CC1)c1nc(N)c(nc1Cl)C(N)=O
: