Target
Protein-lysine 6-oxidase
Ligand
BDBM50446740
Substrate
Meas. Tech.
ChEMBL_1288378 (CHEMBL3118036)
IC50
>1000000±n/a nM
Citation
 Lucchesini, FPocci, MAlfei, SBertini, VBuffoni, F Synthesis of 2,6-disubstituted benzylamine derivatives as reversible selective inhibitors of copper amine oxidases. Bioorg Med Chem 22:1558-67 (2014)  
Target
Name:
Protein-lysine 6-oxidase
Synonyms:
LOX | LYOX_PIG
Type:
PROTEIN
Mol. Mass.:
28737.77
Organism:
Sus scrofa
Description:
ChEMBL_108023
Residue:
246
  
Inhibitor
Name:
BDBM50446740
Synonyms:
CHEMBL3114414
Type:
Small organic molecule
Emp. Form.:
C11H17N
Mol. Mass.:
163.2594
SMILES:
CCc1cccc(CC)c1CN
: