Target
Neuroendocrine convertase 2
Ligand
BDBM50446944
Substrate
Meas. Tech.
ChEMBL_1290738 (CHEMBL3117750)
Ki
0.240000±n/a nM
Citation
 Kwiatkowska, ACouture, FLevesque, CLy, KDesjardins, RBeauchemin, SPrahl, ALammek, BNeugebauer, WDory, YLDay, R Design, synthesis, and structure-activity relationship studies of a potent PACE4 inhibitor. J Med Chem 57:98-109 (2014)  
Target
Name:
Neuroendocrine convertase 2
Synonyms:
KEX2-like endoprotease 2 NEC2 Neuroendocrine convertase 2 PCSK2 Proprotein convertase 2
Type:
PROTEIN
Mol. Mass.:
70563.93
Organism:
Homo sapiens (Human)
Description:
ChEMBL_1290738
Residue:
638
  
Inhibitor
Name:
BDBM50446944
Synonyms:
CHEMBL3115771
Type:
Small organic molecule
Emp. Form.:
C51H90N14O8
Mol. Mass.:
1027.3493
SMILES:
[#6]-[#6](-[#6])-[#6]-[#6@H](-[#7]-[#6](-[#6])=O)-[#6](=O)-[#7]-[#6@@H](-[#6]-[#6](-[#6])-[#6])-[#6](=O)-[#7]-[#6@@H](-[#6]-[#6](-[#6])-[#6])-[#6](=O)-[#7]-[#6@@H](-[#6]-[#6](-[#6])-[#6])-[#6](=O)-[#7]-[#6@@H](-[#6]-[#6]-[#6]\[#7]=[#6](/[#7])-[#7])-[#6](=O)-[#7]-[#6@@H](-[#6](-[#6])-[#6])-[#6](=O)-[#7]-[#6@@H](-[#6]-[#6]-[#6]-[#6]-[#7])-[#6](=O)-[#7]-[#6]-c1ccc(cc1)-[#6](-[#7])=[#7]
: