Target
Polyunsaturated fatty acid lipoxygenase ALOX15
Ligand
BDBM50447181
Substrate
Meas. Tech.
ChEMBL_1290552 (CHEMBL3116601)
IC50
>100000±n/a nM
Citation
 Luci, DKJameson, JBYasgar, ADiaz, GJoshi, NKantz, AMarkham, KPerry, SKuhn, NYeung, JKerns, EHSchultz, LHolinstat, MNadler, JLTaylor-Fishwick, DAJadhav, ASimeonov, AHolman, TRMaloney, DJ Synthesis and structure-activity relationship studies of 4-((2-hydroxy-3-methoxybenzyl)amino)benzenesulfonamide derivatives as potent and selective inhibitors of 12-lipoxygenase. J Med Chem 57:495-506 (2014)  
Target
Name:
Polyunsaturated fatty acid lipoxygenase ALOX15
Synonyms:
15-Lipoxygenase-1 (15-LOX-1) Arachidonate 15-lipoxygenase LOG15 Reticulocyte 15-lipoxygenase-1 | Sphingosine 1-phosphate receptor 1 (S1P1)
Type:
Protein
Mol. Mass.:
74804.05
Organism:
Homo sapiens (Human)
Description:
Residue:
662
  
Inhibitor
Name:
BDBM50447181
Synonyms:
CHEMBL3113197 | US10752581, Compound 67
Type:
Small organic molecule
Emp. Form.:
C23H26N2O4S
Mol. Mass.:
426.529
SMILES:
COc1cccc(CNc2ccc(cc2)S(=O)(=O)Nc2cccc(c2)C(C)C)c1O
: