Target
Polyunsaturated fatty acid lipoxygenase ALOX12
Ligand
BDBM50447212
Substrate
Meas. Tech.
ChEMBL_1290553 (CHEMBL3116602)
IC50
1300±n/a nM
Citation
 Luci, DKJameson, JBYasgar, ADiaz, GJoshi, NKantz, AMarkham, KPerry, SKuhn, NYeung, JKerns, EHSchultz, LHolinstat, MNadler, JLTaylor-Fishwick, DAJadhav, ASimeonov, AHolman, TRMaloney, DJ Synthesis and structure-activity relationship studies of 4-((2-hydroxy-3-methoxybenzyl)amino)benzenesulfonamide derivatives as potent and selective inhibitors of 12-lipoxygenase. J Med Chem 57:495-506 (2014)  
Target
Name:
Polyunsaturated fatty acid lipoxygenase ALOX12
Synonyms:
12-LOX 12LO Arachidonate 12-lipoxygenase LOG12 Platelet 12-lipoxygenase | Platelet-type lipoxygenase 12
Type:
Protein
Mol. Mass.:
75689.18
Organism:
Homo sapiens (Human)
Description:
P18054
Residue:
663
  
Inhibitor
Name:
BDBM50447212
Synonyms:
CHEMBL3113181 | US10752581, Compound 51
Type:
Small organic molecule
Emp. Form.:
C26H24N2O4S
Mol. Mass.:
460.545
SMILES:
COc1cccc(CNc2ccc(cc2)S(=O)(=O)Nc2ccc(cc2)-c2ccccc2)c1O
: