Target
11-beta-hydroxysteroid dehydrogenase 1
Ligand
BDBM50448230
Substrate
Meas. Tech.
ChEMBL_1293357 (CHEMBL3122300)
IC50
1.000000±n/a nM
Citation
 Lee, YShin, YJAhn, SK 3-Amino-N-adamantyl-3-methylbutanamide derivatives as 11ß-hydroxysteroid dehydrogenase 1 inhibitor. Bioorg Med Chem Lett 24:1421-5 (2014)  
Target
Name:
11-beta-hydroxysteroid dehydrogenase 1
Synonyms:
11-DH 11-beta-Hydroxysteroid Dehydrogenase 1 (11-beta-HSD1) 11-beta-hydroxysteroid dehydrogenase 1 (11HSD1) Corticosteroid 11-beta-dehydrogenase isozyme 1 (11-beta-HSD-1) Corticosteroid 11-beta-dehydrogenase isozyme 1 (11beta-HSD1) HSD11 HSD11L | SDR26C1
Type:
Enzyme
Mol. Mass.:
32409.16
Organism:
Homo sapiens (Human)
Description:
P28845
Residue:
292
  
Inhibitor
Name:
BDBM50448230
Synonyms:
CHEMBL3120819
Type:
Small organic molecule
Emp. Form.:
C22H29F2N3O4S
Mol. Mass.:
469.545
SMILES:
CC(C)(CC(=O)N[C@H]1C2CC3CC1C[C@](C3)(C2)C(N)=O)NS(=O)(=O)c1ccc(F)cc1F
: