Target
DNA (cytosine-5)-methyltransferase 1
Ligand
BDBM50448489
Substrate
Meas. Tech.
ChEMBL_1294385 (CHEMBL3129170)
IC50
650±n/a nM
Citation
 Valente, SLiu, YSchnekenburger, MZwergel, CCosconati, SGros, CTardugno, MLabella, DFlorean, CMinden, SHashimoto, HChang, YZhang, XKirsch, GNovellino, EArimondo, PBMiele, EFerretti, EGulino, ADiederich, MCheng, XMai, A Selective non-nucleoside inhibitors of human DNA methyltransferases active in cancer including in cancer stem cells. J Med Chem 57:701-13 (2014)  
Target
Name:
DNA (cytosine-5)-methyltransferase 1
Synonyms:
AIM CXXC9 DNA (cytosine-5)-methyltransferase 1 isoform b DNA methyltransferase HsaI DNMT1 M.HsaI | MCMT
Type:
Enzyme
Mol. Mass.:
183184.85
Organism:
Homo sapiens (Human)
Description:
P26358
Residue:
1616
  
Inhibitor
Name:
BDBM50448489
Synonyms:
CHEMBL3126651
Type:
Small organic molecule
Emp. Form.:
C31H23N5O
Mol. Mass.:
481.5472
SMILES:
O=C(Nc1ccc(Nc2ccnc3ccccc23)cc1)c1ccc(Nc2ccnc3ccccc23)cc1
: