Target
Fatty-acid amide hydrolase 1 [30-579]
Ligand
BDBM50448901
Substrate
Meas. Tech.
ChEMBL_1296377 (CHEMBL3129924)
Ki
1.4±n/a nM
Citation
 Otrubova, KCravatt, BFBoger, DL Design, synthesis, and characterization ofa-ketoheterocycles that additionally target the cytosolic port Cys269 of fatty acid amide hydrolase. J Med Chem 57:1079-89 (2014)  
Target
Name:
Fatty-acid amide hydrolase 1 [30-579]
Synonyms:
Anandamide amidohydrolase 1 Faah Fatty Acid Amide Hydrolase Fatty-acid amide hydrolase (FAAH) Fatty-acid amide hydrolase 1 (FAAH) Oleamide hydrolase 1
Type:
Single-pass membrane protein; homodimer
Mol. Mass.:
60474.00
Organism:
Rattus norvegicus (rat)
Description:
P97612 (aa 30-579)
Residue:
550
  
Inhibitor
Name:
BDBM50448901
Synonyms:
CHEMBL3125291
Type:
Small organic molecule
Emp. Form.:
C22H29NO3S
Mol. Mass.:
387.536
SMILES:
CSC(=O)CCCCc1cnc(o1)C(=O)CCCCCCc1ccccc1
: