Target
Fatty-acid amide hydrolase 1 [30-579]
Ligand
BDBM50448893
Substrate
Meas. Tech.
ChEMBL_1296378 (CHEMBL3129925)
Ki
1.000000±n/a nM
Citation
 Otrubova, KCravatt, BFBoger, DL Design, synthesis, and characterization ofa-ketoheterocycles that additionally target the cytosolic port Cys269 of fatty acid amide hydrolase. J Med Chem 57:1079-89 (2014)  
Target
Name:
Fatty-acid amide hydrolase 1 [30-579]
Synonyms:
Anandamide amidohydrolase 1 Faah Fatty Acid Amide Hydrolase Fatty-acid amide hydrolase (FAAH) Fatty-acid amide hydrolase 1 (FAAH) Oleamide hydrolase 1
Type:
Single-pass membrane protein; homodimer
Mol. Mass.:
60474.00
Organism:
Rattus norvegicus (rat)
Description:
P97612 (aa 30-579)
Residue:
550
  
Inhibitor
Name:
BDBM50448893
Synonyms:
CHEMBL3125287
Type:
Small organic molecule
Emp. Form.:
C24H26N2O4S
Mol. Mass.:
438.539
SMILES:
CS(=O)(=O)C=Cc1ccc(nc1)-c1cnc(o1)C(=O)CCCCCCc1ccccc1
: