Target
Neuronal acetylcholine receptor subunit alpha-3/beta-4
Ligand
BDBM50452056
Substrate
Meas. Tech.
ChEMBL_143404 (CHEMBL752659)
Ki
48±n/a nM
Citation
 Wei, ZLXiao, YKellar, KJKozikowski, AP Synthesis and pharmacological characterization of bivalent ligands of epibatidine at neuronal nicotinic acetylcholine receptors. Bioorg Med Chem Lett 14:1855-8 (2004)  
Target
Name:
Neuronal acetylcholine receptor subunit alpha-3/beta-4
Synonyms:
Neuronal acetylcholine receptor Alpha-3/Beta-4 Neuronal acetylcholine receptor; alpha3/beta4 | nAChR subtypes alpha3 beta4
Type:
Protein
Mol. Mass.:
Description:
Components:
This complex has 2 components.
Component 1
Name:
Neuronal acetylcholine receptor subunit alpha-3
Synonyms:
ACHA3_RAT Chrna3
Type:
Enzyme
Mol. Mass.:
56995.52
Organism:
Rattus norvegicus (Rat)
Description:
P04757
Residue:
499
  
Component 2
Name:
Neuronal acetylcholine receptor subunit beta-4
Synonyms:
ACHB4_RAT Chrnb4 Neuronal acetylcholine receptor non-alpha-2 chain | Neuronal acetylcholine receptor protein beta-4 subunit
Type:
Enzyme
Mol. Mass.:
55863.89
Organism:
Rattus norvegicus (Rat)
Description:
P12392
Residue:
495
  
Inhibitor
Name:
BDBM50452056
Synonyms:
CHEMBL417586
Type:
Small organic molecule
Emp. Form.:
C24H28Cl2N4
Mol. Mass.:
443.412
SMILES:
Clc1ccc(cn1)C1CC2CCC1N2CCN1C2CCC1C(C2)c1ccc(Cl)nc1
: