Target
Adenosine receptor A1
Ligand
BDBM50051357
Substrate
Meas. Tech.
ChEMBL_27471 (CHEMBL642480)
Ki
32359±n/a nM
Citation
 Moro, Svan Rhee, AMSanders, LHJacobson, KA Flavonoid derivatives as adenosine receptor antagonists: a comparison of the hypothetical receptor binding site based on a comparative molecular field analysis model. J Med Chem 41:46-52 (1998)  
Target
Name:
Adenosine receptor A1
Synonyms:
AA1R_RAT ADENOSINE A1 high Adenosine A1 receptor (A1) Adenosine receptors A1 | Adora1
Type:
Protein
Mol. Mass.:
36704.13
Organism:
Rattus norvegicus (rat)
Description:
Residue:
326
  
Inhibitor
Name:
BDBM50051357
Synonyms:
2-(2,4-Diethoxy-phenyl)-3,5,7-triethoxy-chromen-4-one | CHEMBL74505
Type:
Small organic molecule
Emp. Form.:
C25H30O7
Mol. Mass.:
442.5015
SMILES:
CCOc1ccc(c(OCC)c1)-c1oc2cc(OCC)cc(OCC)c2c(=O)c1OCC
: