Target
Adenosine receptor A3
Ligand
BDBM50051357
Substrate
Meas. Tech.
ChEMBL_30324 (CHEMBL638578)
Ki
7244±n/a nM
Citation
 Moro, Svan Rhee, AMSanders, LHJacobson, KA Flavonoid derivatives as adenosine receptor antagonists: a comparison of the hypothetical receptor binding site based on a comparative molecular field analysis model. J Med Chem 41:46-52 (1998)  
Target
Name:
Adenosine receptor A3
Synonyms:
A3 adenosine receptor (hA3) ADORA3 | Adenosine A3 receptor (A3AR)
Type:
G Protein-Coupled Receptor (GPCR)
Mol. Mass.:
36197.32
Organism:
Homo sapiens (Human)
Description:
P0DMS8
Residue:
318
  
Inhibitor
Name:
BDBM50051357
Synonyms:
2-(2,4-Diethoxy-phenyl)-3,5,7-triethoxy-chromen-4-one | CHEMBL74505
Type:
Small organic molecule
Emp. Form.:
C25H30O7
Mol. Mass.:
442.5015
SMILES:
CCOc1ccc(c(OCC)c1)-c1oc2cc(OCC)cc(OCC)c2c(=O)c1OCC
: