Target
Adenosine receptor A2a
Ligand
BDBM50051357
Substrate
Meas. Tech.
ChEMBL_30279 (CHEMBL640100)
Ki
26303±n/a nM
Citation
 Moro, Svan Rhee, AMSanders, LHJacobson, KA Flavonoid derivatives as adenosine receptor antagonists: a comparison of the hypothetical receptor binding site based on a comparative molecular field analysis model. J Med Chem 41:46-52 (1998)  
Target
Name:
Adenosine receptor A2a
Synonyms:
AA2AR_RAT Adenosine A2 receptor Adenosine Receptors A2a (A2a) Adenosine receptors A2a Rat striatal adenosine A2a receptor
Type:
G Protein-Coupled Receptor (GPCR)
Mol. Mass.:
45015.65
Organism:
Rattus norvegicus (rat)
Description:
Rat A2A receptors expressed in CHO cells.
Residue:
410
  
Inhibitor
Name:
BDBM50051357
Synonyms:
2-(2,4-Diethoxy-phenyl)-3,5,7-triethoxy-chromen-4-one | CHEMBL74505
Type:
Small organic molecule
Emp. Form.:
C25H30O7
Mol. Mass.:
442.5015
SMILES:
CCOc1ccc(c(OCC)c1)-c1oc2cc(OCC)cc(OCC)c2c(=O)c1OCC
: