Target
Adenosine receptor A2a
Ligand
BDBM50051338
Substrate
Meas. Tech.
ChEMBL_30279 (CHEMBL640100)
Ki
33884±n/a nM
Citation
 Moro, Svan Rhee, AMSanders, LHJacobson, KA Flavonoid derivatives as adenosine receptor antagonists: a comparison of the hypothetical receptor binding site based on a comparative molecular field analysis model. J Med Chem 41:46-52 (1998)  
Target
Name:
Adenosine receptor A2a
Synonyms:
AA2AR_RAT Adenosine A2 receptor Adenosine Receptors A2a (A2a) Adenosine receptors A2a Rat striatal adenosine A2a receptor
Type:
G Protein-Coupled Receptor (GPCR)
Mol. Mass.:
45015.65
Organism:
Rattus norvegicus (rat)
Description:
Rat A2A receptors expressed in CHO cells.
Residue:
410
  
Inhibitor
Name:
BDBM50051338
Synonyms:
4-Ethoxy-7-((E)-styryl)-furo[3,2-g]chromen-5-one | CHEMBL76874
Type:
Small organic molecule
Emp. Form.:
C21H16O4
Mol. Mass.:
332.3493
SMILES:
CCOc1c2ccoc2cc2oc(\C=C\c3ccccc3)cc(=O)c12
: