Target
Adenosine receptor A3
Ligand
BDBM50051351
Substrate
Meas. Tech.
ChEMBL_30324 (CHEMBL638578)
Ki
23988±n/a nM
Citation
 Moro, Svan Rhee, AMSanders, LHJacobson, KA Flavonoid derivatives as adenosine receptor antagonists: a comparison of the hypothetical receptor binding site based on a comparative molecular field analysis model. J Med Chem 41:46-52 (1998)  
Target
Name:
Adenosine receptor A3
Synonyms:
A3 adenosine receptor (hA3) ADORA3 | Adenosine A3 receptor (A3AR)
Type:
G Protein-Coupled Receptor (GPCR)
Mol. Mass.:
36197.32
Organism:
Homo sapiens (Human)
Description:
P0DMS8
Residue:
318
  
Inhibitor
Name:
BDBM50051351
Synonyms:
3-Hydroxy-6-methoxy-2-phenylethynyl-chromen-4-one | CHEMBL74328
Type:
Small organic molecule
Emp. Form.:
C18H12O4
Mol. Mass.:
292.2855
SMILES:
COc1ccc2oc(C#Cc3ccccc3)c(O)c(=O)c2c1
: