Target
Vasopressin V1a receptor
Ligand
BDBM50372611
Substrate
Meas. Tech.
ChEMBL_321077 (CHEMBL872157)
Ki
<6310±n/a nM
Citation
 Borthwick, ADDavies, DEExall, AMLivermore, DGSollis, SLNerozzi, FAllen, MJPerren, MShabbir, SSWoollard, PMWyatt, PG 2,5-diketopiperazines as potent, selective, and orally bioavailable oxytocin antagonists. 2. Synthesis, chirality, and pharmacokinetics. J Med Chem 48:6956-69 (2005)  
Target
Name:
Vasopressin V1a receptor
Synonyms:
AVPR V1a AVPR1A V1AR_HUMAN VASOPRESSIN V1A Vasopressin V1 receptor Vasopressin receptor
Type:
Receptor
Mol. Mass.:
46820.18
Organism:
Homo sapiens (Human)
Description:
P37288
Residue:
418
  
Inhibitor
Name:
BDBM50372611
Synonyms:
CHEMBL196478
Type:
Small organic molecule
Emp. Form.:
C28H33F2N3O3
Mol. Mass.:
497.5767
SMILES:
CC(C)C[C@H]1N([C@@H](C(=O)NC(C)C)c2ccc(F)cc2F)C(=O)[C@H](NC1=O)C1Cc2ccccc2C1
: