Target
Oxytocin receptor
Ligand
BDBM50002419
Substrate
Meas. Tech.
ChEMBL_321073 (CHEMBL885138)
Ki
40±n/a nM
Citation
 Borthwick, ADDavies, DEExall, AMLivermore, DGSollis, SLNerozzi, FAllen, MJPerren, MShabbir, SSWoollard, PMWyatt, PG 2,5-diketopiperazines as potent, selective, and orally bioavailable oxytocin antagonists. 2. Synthesis, chirality, and pharmacokinetics. J Med Chem 48:6956-69 (2005)  
Target
Name:
Oxytocin receptor
Synonyms:
OT-R OXYR_HUMAN | Oxytocin
Type:
Enzyme Catalytic Domain
Mol. Mass.:
42793.26
Organism:
Homo sapiens (Human)
Description:
Oxytocin OXTR HEK293::B2R9L7
Residue:
389
  
Inhibitor
Name:
BDBM50002419
Synonyms:
CHEMBL197822
Type:
Small organic molecule
Emp. Form.:
C30H39N3O4
Mol. Mass.:
505.6484
SMILES:
COc1ccc(cc1)[C@H](N1[C@H](CC(C)C)C(=O)N[C@H](C2Cc3ccccc3C2)C1=O)C(=O)NC(C)(C)C
: