Target
Vasopressin V2 receptor
Ligand
BDBM50372611
Substrate
Meas. Tech.
ChEMBL_321075 (CHEMBL885140)
Ki
631±n/a nM
Citation
 Borthwick, ADDavies, DEExall, AMLivermore, DGSollis, SLNerozzi, FAllen, MJPerren, MShabbir, SSWoollard, PMWyatt, PG 2,5-diketopiperazines as potent, selective, and orally bioavailable oxytocin antagonists. 2. Synthesis, chirality, and pharmacokinetics. J Med Chem 48:6956-69 (2005)  
Target
Name:
Vasopressin V2 receptor
Synonyms:
ADHR AVPR2 DIR Renal-type arginine vasopressin receptor V2R_HUMAN Vasopressin V2 receptor | Vasopressin receptor
Type:
Receptor
Mol. Mass.:
40295.28
Organism:
Homo sapiens (Human)
Description:
P30518
Residue:
371
  
Inhibitor
Name:
BDBM50372611
Synonyms:
CHEMBL196478
Type:
Small organic molecule
Emp. Form.:
C28H33F2N3O3
Mol. Mass.:
497.5767
SMILES:
CC(C)C[C@H]1N([C@@H](C(=O)NC(C)C)c2ccc(F)cc2F)C(=O)[C@H](NC1=O)C1Cc2ccccc2C1
: