Target
Oxytocin receptor
Ligand
BDBM50002428
Substrate
Meas. Tech.
ChEMBL_321073 (CHEMBL885138)
Ki
1.6±n/a nM
Citation
 Borthwick, ADDavies, DEExall, AMLivermore, DGSollis, SLNerozzi, FAllen, MJPerren, MShabbir, SSWoollard, PMWyatt, PG 2,5-diketopiperazines as potent, selective, and orally bioavailable oxytocin antagonists. 2. Synthesis, chirality, and pharmacokinetics. J Med Chem 48:6956-69 (2005)  
Target
Name:
Oxytocin receptor
Synonyms:
OT-R OXYR_HUMAN | Oxytocin
Type:
Enzyme Catalytic Domain
Mol. Mass.:
42793.26
Organism:
Homo sapiens (Human)
Description:
Oxytocin OXTR HEK293::B2R9L7
Residue:
389
  
Inhibitor
Name:
BDBM50002428
Synonyms:
CHEMBL371008
Type:
Small organic molecule
Emp. Form.:
C30H38N4O4
Mol. Mass.:
518.6471
SMILES:
CC(C)C[C@H]1N([C@@H](C(=O)NC(C)C)c2ccc(NC(C)=O)cc2)C(=O)[C@H](NC1=O)C1Cc2ccccc2C1
: