Target
Oxytocin receptor
Ligand
BDBM50002437
Substrate
Meas. Tech.
ChEMBL_321073 (CHEMBL885138)
Ki
79±n/a nM
Citation
 Borthwick, ADDavies, DEExall, AMLivermore, DGSollis, SLNerozzi, FAllen, MJPerren, MShabbir, SSWoollard, PMWyatt, PG 2,5-diketopiperazines as potent, selective, and orally bioavailable oxytocin antagonists. 2. Synthesis, chirality, and pharmacokinetics. J Med Chem 48:6956-69 (2005)  
Target
Name:
Oxytocin receptor
Synonyms:
OT-R OXYR_HUMAN | Oxytocin
Type:
Enzyme Catalytic Domain
Mol. Mass.:
42793.26
Organism:
Homo sapiens (Human)
Description:
Oxytocin OXTR HEK293::B2R9L7
Residue:
389
  
Inhibitor
Name:
BDBM50002437
Synonyms:
CHEMBL194233
Type:
Small organic molecule
Emp. Form.:
C29H34F3N3O3
Mol. Mass.:
529.5938
SMILES:
CC(C)C[C@H]1N([C@H](C(=O)NC(C)C)c2ccc(cc2)C(F)(F)F)C(=O)[C@H](NC1=O)C1Cc2ccccc2C1
: