Target
Substance-K receptor
Ligand
BDBM50002935
Substrate
Meas. Tech.
ChEMBL_448555 (CHEMBL897704)
Ki
25±n/a nM
Citation
 Sisto, AAltamura, MCardinali, FD'Andrea, PRossi, CFattori, D alpha,alpha-Cyclic aminoacids as useful scaffolds for the preparation of hNK(2) receptor antagonists. Bioorg Med Chem Lett 17:4841-4 (2007)  
Target
Name:
Substance-K receptor
Synonyms:
NK2R_CAVPO Neurokinin NK2 TACR2
Type:
Enzyme Catalytic Domain
Mol. Mass.:
45106.00
Organism:
GUINEA PIG
Description:
Neurokinin NK2 TACR2 GUINEA PIG::Q64077
Residue:
402
  
Inhibitor
Name:
BDBM50002935
Synonyms:
CHEMBL242631 | MEN-14268
Type:
Small organic molecule
Emp. Form.:
C31H38N4O4S
Mol. Mass.:
562.723
SMILES:
O=C(NCCCN1CCOCC1)[C@@H](Cc1ccccc1)NC(=O)C1(CCCC1)NC(=O)c1cc2ccccc2s1
: