Target
Alpha-1B adrenergic receptor
Ligand
BDBM50392637
Substrate
Meas. Tech.
ChEMBL_936572 (CHEMBL2318735)
Ki
5.8±n/a nM
Citation
 Bonifazi, APiergentili, ADel Bello, FFarande, YGiannella, MPigini, MAmantini, CNabissi, MFarfariello, VSantoni, GPoggesi, ELeonardi, AMenegon, SQuaglia, W Structure-activity relationships in 1,4-benzodioxan-related compounds. 11. (1) reversed enantioselectivity of 1,4-dioxane derivatives ina1-adrenergic and 5-HT1A receptor binding sites recognition. J Med Chem 56:584-8 (2013)  
Target
Name:
Alpha-1B adrenergic receptor
Synonyms:
ADA1B_HUMAN Adrenergic alpha1B Adrenergic receptor alpha Alpha 1B-adrenoreceptor | Alpha-1B adrenergic receptor
Type:
Enzyme
Mol. Mass.:
56862.13
Organism:
Homo sapiens (Human)
Description:
P35368
Residue:
520
  
Inhibitor
Name:
BDBM50392637
Synonyms:
CHEMBL215421
Type:
Small organic molecule
Emp. Form.:
C19H23NO5
Mol. Mass.:
345.3896
SMILES:
COc1cccc(OC)c1OCCNC[C@H]1COc2ccccc2O1
: