Target
Alpha-1B adrenergic receptor
Ligand
BDBM50004768
Substrate
Meas. Tech.
ChEMBL_936572 (CHEMBL2318735)
Ki
170±n/a nM
Citation
 Bonifazi, APiergentili, ADel Bello, FFarande, YGiannella, MPigini, MAmantini, CNabissi, MFarfariello, VSantoni, GPoggesi, ELeonardi, AMenegon, SQuaglia, W Structure-activity relationships in 1,4-benzodioxan-related compounds. 11. (1) reversed enantioselectivity of 1,4-dioxane derivatives ina1-adrenergic and 5-HT1A receptor binding sites recognition. J Med Chem 56:584-8 (2013)  
Target
Name:
Alpha-1B adrenergic receptor
Synonyms:
ADA1B_HUMAN Adrenergic alpha1B Adrenergic receptor alpha Alpha 1B-adrenoreceptor | Alpha-1B adrenergic receptor
Type:
Enzyme
Mol. Mass.:
56862.13
Organism:
Homo sapiens (Human)
Description:
P35368
Residue:
520
  
Inhibitor
Name:
BDBM50004768
Synonyms:
CHEMBL2312538
Type:
Small organic molecule
Emp. Form.:
C25H27NO3
Mol. Mass.:
389.4868
SMILES:
C(COc1ccccc1)NC[C@H]1COCC(O1)(c1ccccc1)c1ccccc1
: