Target
Luciferin 4-monooxygenase
Ligand
BDBM50004830
Substrate
Meas. Tech.
ChEMBL_938513 (CHEMBL2327197)
IC50
>10000±n/a nM
Citation
 Poutiainen, PKPalvimo, JJHinkkanen, AEValkonen, AVäisänen, TKLaatikainen, RPulkkinen, JT Discovery of 5-benzyl-3-phenyl-4,5-dihydroisoxazoles and 5-benzyl-3-phenyl-1,4,2-dioxazoles as potent firefly luciferase inhibitors. J Med Chem 56:1064-73 (2013)  
Target
Name:
Luciferin 4-monooxygenase
Synonyms:
LUCI_PHOPY | Luciferase
Type:
PROTEIN
Mol. Mass.:
60747.46
Organism:
Photinus pyralis
Description:
ChEMBL_938513
Residue:
550
  
Inhibitor
Name:
BDBM50004830
Synonyms:
CHEMBL2324060
Type:
Small organic molecule
Emp. Form.:
C18H19NO3
Mol. Mass.:
297.3484
SMILES:
COc1ccc(C[C@@H]2CC(=NO2)c2ccc(OC)cc2)cc1
: