Target
Homeodomain-interacting protein kinase 3
Ligand
BDBM50001733
Substrate
Meas. Tech.
ChEMBL_1337689 (CHEMBL3242877)
IC50
>10000±n/a nM
Citation
 Mahmoud, KAKrug, MWersig, TSlynko, ISchächtele, CTotzke, FSippl, WHilgeroth, A Discovery of 4-anilinoa-carbolines as novel Brk inhibitors. Bioorg Med Chem Lett 24:1948-51 (2014)  
Target
Name:
Homeodomain-interacting protein kinase 3
Synonyms:
DYRK6 HIPK3 PKY
Type:
PROTEIN
Mol. Mass.:
133763.81
Organism:
Homo sapiens (Human)
Description:
ChEMBL_774503
Residue:
1215
  
Inhibitor
Name:
BDBM50001733
Synonyms:
CHEMBL3133821
Type:
Small organic molecule
Emp. Form.:
C17H13N3O
Mol. Mass.:
275.3046
SMILES:
Oc1cccc(Nc2ccnc3[nH]c4ccccc4c23)c1
: