Target
Carbonic anhydrase 12
Ligand
BDBM50442522
Substrate
Meas. Tech.
ChEMBL_1337727 (CHEMBL3240047)
IC50
269±n/a nM
Citation
 Tauro, MLoiodice, FCeruso, MSupuran, CTTortorella, P Arylamino bisphosphonates: potent and selective inhibitors of the tumor-associated carbonic anhydrase XII. Bioorg Med Chem Lett 24:1941-3 (2014)  
Target
Name:
Carbonic anhydrase 12
Synonyms:
CA-XII CAH12_HUMAN Carbonic anhydrase Carbonic anhydrase XII Carbonic anhydrase XII (CAXII) | Tumor antigen HOM-RCC-3.1.3
Type:
Enzyme
Mol. Mass.:
39456.00
Organism:
Homo sapiens (Human)
Description:
Catalytic domain of human cloned isozyme was used in the assay
Residue:
354
  
Inhibitor
Name:
BDBM50442522
Synonyms:
CHEMBL2440581
Type:
Small organic molecule
Emp. Form.:
C7H10FNO6P2
Mol. Mass.:
285.1033
SMILES:
OP(O)(=O)C(Nc1ccc(F)cc1)P(O)(O)=O
: