Target
Adenosine receptor A1
Ligand
BDBM50003649
Substrate
Meas. Tech.
ChEMBL_1336085 (CHEMBL3240796)
Ki
14±n/a nM
Citation
 Louvel, JGuo, DAgliardi, MMocking, TAKars, RPham, TPXia, Lde Vries, HBrussee, JHeitman, LHIjzerman, AP Agonists for the adenosine A1 receptor with tunable residence time. A Case for nonribose 4-amino-6-aryl-5-cyano-2-thiopyrimidines. J Med Chem 57:3213-22 (2014)  
Target
Name:
Adenosine receptor A1
Synonyms:
A1 adenosine receptor (hA1) AA1R_HUMAN ADORA1 Adenosine A1-receptor Adenosine receptor A1 (hA1) | Adenosine transporter (AdT)
Type:
G Protein-Coupled Receptor (GPCR)
Mol. Mass.:
36520.92
Organism:
Homo sapiens (Human)
Description:
P30542
Residue:
326
  
Inhibitor
Name:
BDBM50003649
Synonyms:
CHEMBL3234937
Type:
Small organic molecule
Emp. Form.:
C23H17ClN6OS2
Mol. Mass.:
493.004
SMILES:
CC(=O)Nc1ccc(cc1)-c1nc(SCc2csc(n2)-c2ccc(Cl)cc2)nc(N)c1C#N
: