Target
Adenosine receptor A1
Ligand
BDBM50003708
Substrate
Meas. Tech.
ChEMBL_1336093 (CHEMBL3240804)
EC50
4.6±n/a nM
Citation
 Louvel, JGuo, DAgliardi, MMocking, TAKars, RPham, TPXia, Lde Vries, HBrussee, JHeitman, LHIjzerman, AP Agonists for the adenosine A1 receptor with tunable residence time. A Case for nonribose 4-amino-6-aryl-5-cyano-2-thiopyrimidines. J Med Chem 57:3213-22 (2014)  
Target
Name:
Adenosine receptor A1
Synonyms:
A1 adenosine receptor (hA1) AA1R_HUMAN ADORA1 Adenosine A1-receptor Adenosine receptor A1 (hA1) | Adenosine transporter (AdT)
Type:
G Protein-Coupled Receptor (GPCR)
Mol. Mass.:
36520.92
Organism:
Homo sapiens (Human)
Description:
P30542
Residue:
326
  
Inhibitor
Name:
BDBM50003708
Synonyms:
CHEMBL3234962
Type:
Small organic molecule
Emp. Form.:
C22H15N5O2S2
Mol. Mass.:
445.517
SMILES:
Nc1nc(SCc2csc(n2)-c2ccccc2)nc(-c2ccc3OCOc3c2)c1C#N
: