Target
Aurora kinase B
Ligand
BDBM50004206
Substrate
Meas. Tech.
ChEMBL_1339460 (CHEMBL3243853)
IC50
290±n/a nM
Citation
 Luo, YDeng, YQWang, JLong, ZJTu, ZCPeng, WZhang, JQLiu, QLu, G Design, synthesis and bioevaluation of N-trisubstituted pyrimidine derivatives as potent aurora A kinase inhibitors. Eur J Med Chem 78:65-71 (2014)  
Target
Name:
Aurora kinase B
Synonyms:
AIK2 AIM1 ARK2 AURKB_HUMAN Aurora B-INCENP Aurora kinase B (AURKB) STK-1 STK12 Serine/threonine-protein kinase aurora B
Type:
Protein
Mol. Mass.:
39327.72
Organism:
Homo sapiens (Human)
Description:
Q96GD4
Residue:
344
  
Inhibitor
Name:
BDBM50004206
Synonyms:
CHEMBL3237191
Type:
Small organic molecule
Emp. Form.:
C25H31N7O6
Mol. Mass.:
525.5569
SMILES:
OC(C(O)C(O)=O)C(O)=O.CN1CCN(CC1)c1cc(Nc2cc(C)[nH]n2)nc(\C=C\c2ccccc2)n1
: