Target
Aurora kinase A
Ligand
BDBM50004212
Substrate
Meas. Tech.
ChEMBL_1339461 (CHEMBL3243854)
IC50
573±n/a nM
Citation
 Luo, YDeng, YQWang, JLong, ZJTu, ZCPeng, WZhang, JQLiu, QLu, G Design, synthesis and bioevaluation of N-trisubstituted pyrimidine derivatives as potent aurora A kinase inhibitors. Eur J Med Chem 78:65-71 (2014)  
Target
Name:
Aurora kinase A
Synonyms:
AIK ARK-1 AURA AURKA_HUMAN Aurora 2 Aurora kinase A (AURKA) Aurora kinase A (Aurora-2) Aurora/IPL1-related kinase 1 Breast tumor-amplified kinase IAK1 STK15 GN Serine/threonine kinase 15 Serine/threonine-protein kinase 6 Serine/threonine-protein kinase aurora-A aurora-2 | hARK1
Type:
Serine/threonine-protein kinase
Mol. Mass.:
45830.98
Organism:
Homo sapiens (Human)
Description:
O14965
Residue:
403
  
Inhibitor
Name:
BDBM50004212
Synonyms:
CHEMBL3237177
Type:
Small organic molecule
Emp. Form.:
C27H30N8O4S
Mol. Mass.:
562.643
SMILES:
COC(=O)c1ccc(Nc2nc(Nc3cc(C)[nH]n3)cc(n2)N2CCN(CC2)S(=O)(=O)c2ccc(C)cc2)cc1
: