Target
Aurora kinase A
Ligand
BDBM50004220
Substrate
Meas. Tech.
ChEMBL_1339461 (CHEMBL3243854)
IC50
34±n/a nM
Citation
 Luo, YDeng, YQWang, JLong, ZJTu, ZCPeng, WZhang, JQLiu, QLu, G Design, synthesis and bioevaluation of N-trisubstituted pyrimidine derivatives as potent aurora A kinase inhibitors. Eur J Med Chem 78:65-71 (2014)  
Target
Name:
Aurora kinase A
Synonyms:
AIK ARK-1 AURA AURKA_HUMAN Aurora 2 Aurora kinase A (AURKA) Aurora kinase A (Aurora-2) Aurora/IPL1-related kinase 1 Breast tumor-amplified kinase IAK1 STK15 GN Serine/threonine kinase 15 Serine/threonine-protein kinase 6 Serine/threonine-protein kinase aurora-A aurora-2 | hARK1
Type:
Serine/threonine-protein kinase
Mol. Mass.:
45830.98
Organism:
Homo sapiens (Human)
Description:
O14965
Residue:
403
  
Inhibitor
Name:
BDBM50004220
Synonyms:
CHEMBL3237185
Type:
Small organic molecule
Emp. Form.:
C20H26N8O
Mol. Mass.:
394.4734
SMILES:
COc1ccc(Nc2nc(Nc3cc(C)[nH]n3)cc(n2)N2CCN(C)CC2)cc1
: