Target
Cannabinoid receptor 1
Ligand
BDBM50380892
Substrate
Meas. Tech.
ChEMBL_1334805 (CHEMBL3238912)
Ki
4600±n/a nM
Citation
 Han, SThatte, JBuzard, DJJones, RM Therapeutic utility of cannabinoid receptor type 2 (CB(2)) selective agonists. Cell Chem Biol 56:8224-56 (2013)  
Target
Name:
Cannabinoid receptor 1
Synonyms:
CANN6 CB-R CNR CNR1_HUMAN Cannabinoid receptor Cannabinoid receptor 1 (brain)
Type:
G Protein-Coupled Receptor (GPCR)
Mol. Mass.:
52868.96
Organism:
Homo sapiens (Human)
Description:
P21554
Residue:
472
  
Inhibitor
Name:
BDBM50380892
Synonyms:
CHEMBL2019090 | S-777469
Type:
Small organic molecule
Emp. Form.:
C23H27FN2O4
Mol. Mass.:
414.4699
SMILES:
CCc1c(C)cc(C(=O)NC2(CCCCC2)C(O)=O)c(=O)n1Cc1ccc(F)cc1
: