Target
Neuronal acetylcholine receptor subunit alpha-7
Ligand
BDBM50364875
Substrate
Meas. Tech.
ChEMBL_1335290 (CHEMBL3238714)
Ki
0.092000±n/a nM
Citation
 Gao, YKellar, KJYasuda, RPTran, TXiao, YDannals, RFHorti, AG Derivatives of dibenzothiophene for positron emission tomography imaging ofa7-nicotinic acetylcholine receptors. J Med Chem 56:7574-89 (2013)  
Target
Name:
Neuronal acetylcholine receptor subunit alpha-7
Synonyms:
ACHA7_HUMAN Cholinergic, Nicotinic Alpha7 Neuronal acetylcholine receptor protein alpha-7 subunit Nicotinic acetylcholine receptor alpha-7 (alpha7 nAChR)
Type:
Mol. Mass.:
56448.33
Organism:
Homo sapiens (Human)
Description:
CHRNA7 (NACHRA7)
Residue:
502
  
Inhibitor
Name:
BDBM50364875
Synonyms:
CHEMBL1950156
Type:
Small organic molecule
Emp. Form.:
C25H28N4O
Mol. Mass.:
400.516
SMILES:
CN1C[C@H]2CN(C[C@@H]12)c1ccc2-c3ccc(cc3C(=O)c2c1)N1C[C@@H]2CN(C)[C@@H]2C1
: