Target
Acetylcholine receptor subunit alpha/Neuronal acetylcholine receptor subunit beta-4
Ligand
BDBM50006615
Substrate
Meas. Tech.
ChEMBL_1335283 (CHEMBL3238707)
Ki
838±n/a nM
Citation
 Gao, YKellar, KJYasuda, RPTran, TXiao, YDannals, RFHorti, AG Derivatives of dibenzothiophene for positron emission tomography imaging ofa7-nicotinic acetylcholine receptors. J Med Chem 56:7574-89 (2013)  
Target
Name:
Acetylcholine receptor subunit alpha/Neuronal acetylcholine receptor subunit beta-4
Synonyms:
Nicotinic acetylcholine receptor alpha2/beta4
Type:
Mol. Mass.:
Description:
ASSAY_ID of ChEMBL is 964979
Components:
This complex has 2 components.
Component 1
Name:
Acetylcholine receptor subunit alpha
Synonyms:
ACHA_HUMAN Acetylcholine receptor protein alpha chain CHNRA Cholinergic, Nicotinic Alpha1Beta1DeltaGamma Nicotinic acetylcholine receptor alpha-1/beta-1 Nicotinic acetylcholine receptor alpha2/beta4 n-AChR
Type:
Ion channel
Mol. Mass.:
54542.01
Organism:
Homo sapiens (Human)
Description:
Residue:
482
  
Component 2
Name:
Neuronal acetylcholine receptor subunit beta-4
Synonyms:
ACHB4_HUMAN Cholinergic, Nicotinic Alpha6Beta3Beta4Alpha5 Nicotinic acetylcholine receptor alpha6/alpha3/beta4
Type:
Enzyme Catalytic Domain
Mol. Mass.:
56388.51
Organism:
Homo sapiens (Human)
Description:
Cholinergic, Nicotinic Alpha6Beta3Beta4Alpha5 0 HUMAN::P30926
Residue:
498
  
Inhibitor
Name:
BDBM50006615
Synonyms:
CHEMBL3235483
Type:
Small organic molecule
Emp. Form.:
C19H19FN2O2S
Mol. Mass.:
358.43
SMILES:
Fc1c2c(ccc1N1CCN3CCC1CC3)-c1ccccc1S2(=O)=O
: