Target
Diacylglycerol O-acyltransferase 1
Ligand
BDBM50009445
Substrate
Meas. Tech.
ChEMBL_1335970 (CHEMBL3239091)
IC50
12±n/a nM
Citation
 Zhou, GTing, PCWishart, GZorn, NAslanian, RGLin, MSmith, MWalker, SSCook, JVan Heek, MLachowicz, J Discovery of novel quinoline carboxylic acid series as DGAT1 inhibitors. Bioorg Med Chem Lett 24:1790-4 (2014)  
Target
Name:
Diacylglycerol O-acyltransferase 1
Synonyms:
ACAT-related gene product 1 Acyl coA-diacylglycerol acyl transferase 1 (DGAT1) DGAT1 Diacylglycerol Acyltransferase (DGAT1) Diacylglycerol O-acyltransferase 1 (DGAT1) | Diglyceride acyltransferase
Type:
Protein
Mol. Mass.:
55297.82
Organism:
Homo sapiens (Human)
Description:
O75907
Residue:
488
  
Inhibitor
Name:
BDBM50009445
Synonyms:
CHEMBL3233889
Type:
Small organic molecule
Emp. Form.:
C36H40N2O3
Mol. Mass.:
548.7144
SMILES:
Cc1cc(C(=O)NCCCCCc2ccccc2)c2ccc(cc2n1)-c1ccc(cc1)[C@H]1CC[C@H](CC(O)=O)CC1
: