Target
Chromobox protein homolog 7
Ligand
BDBM50009487
Substrate
Meas. Tech.
ChEMBL_1336411 (CHEMBL3242415)
IC50
105000±n/a nM
Citation
 Simhadri, CDaze, KDDouglas, SFQuon, TTDev, AGignac, MCPeng, FHeller, MBoulanger, MJWulff, JEHof, F Chromodomain antagonists that target the polycomb-group methyllysine reader protein chromobox homolog 7 (CBX7). J Med Chem 57:2874-83 (2014)  
Target
Name:
Chromobox protein homolog 7
Synonyms:
CBX7 Chromobox protein homolog 7 | Chromobox protein homolog 7 (CBX7)
Type:
Protein
Mol. Mass.:
28351.76
Organism:
Homo sapiens (Human)
Description:
Residue:
251
  
Inhibitor
Name:
BDBM50009487
Synonyms:
CHEMBL3234169
Type:
Small organic molecule
Emp. Form.:
C36H62N7O7
Mol. Mass.:
704.9196
SMILES:
CC(C)C[C@H](NC(=O)[C@H](C)NC(=O)[C@H](Cc1ccccc1)NC(C)=O)C(=O)N[C@@H](CCCC[N+](C)(C)C)C(=O)NCCNC(=O)OC(C)(C)C
: