Target
Cytochrome P450 2C9
Ligand
BDBM50009583
Substrate
Meas. Tech.
ChEMBL_1336869 (CHEMBL3241727)
IC50
>50000±n/a nM
Citation
 Cox, JMChu, HDYang, CShen, HCWu, ZBalsells, JCrespo, ABrown, PZamlynny, BWiltsie, JClemas, JGibson, JContino, LLisnock, JZhou, GGarcia-Calvo, MBateman, TXu, LTong, XCrook, MSinclair, P Mineralocorticoid receptor antagonists: identification of heterocyclic amide replacements in the oxazolidinedione series. Bioorg Med Chem Lett 24:1681-4 (2014)  
Target
Name:
Cytochrome P450 2C9
Synonyms:
(R)-limonene 6-monooxygenase CP2C9_HUMAN CYP2C9 Cytochrome P450 2C9 (CYP2C9 ) P-450MP P450 PB-1 | S-mephenytoin 4-hydroxylase
Type:
Enzyme
Mol. Mass.:
55636.33
Organism:
Homo sapiens (Human)
Description:
P11712
Residue:
490
  
Inhibitor
Name:
BDBM50009583
Synonyms:
CHEMBL3234858
Type:
Small organic molecule
Emp. Form.:
C28H25N3O6
Mol. Mass.:
499.5146
SMILES:
COc1cc(OC)cc(c1)-c1nnc(o1)[C@@]1(Cc2ccccc2)OC(=O)N([C@H](C)c2ccccc2)C1=O
: