Target
3-hydroxy-3-methylglutaryl-coenzyme A reductase
Ligand
BDBM50009728
Substrate
Meas. Tech.
ChEMBL_1343944 (CHEMBL3259253)
IC50
570000±n/a nM
Citation
 Dygos, JHJett, CMChinn, LJMiller, JE Hypolipidemic activity of 5-aryl-3-methylvaleric acid derivatives. J Med Chem 20:1705-8 (1978)  
Target
Name:
3-hydroxy-3-methylglutaryl-coenzyme A reductase
Synonyms:
HMDH_RAT Hmgcr
Type:
Enzyme
Mol. Mass.:
96689.85
Organism:
Rattus norvegicus (rat)
Description:
Isolated rat liver microsomes were used as enzyme source.
Residue:
887
  
Inhibitor
Name:
BDBM50009728
Synonyms:
CHEMBL3246895
Type:
Small organic molecule
Emp. Form.:
C18H18O3S
Mol. Mass.:
314.399
SMILES:
CC(CC(O)=O)CC(=O)c1ccc(Sc2ccccc2)cc1
: