Target
3-hydroxy-3-methylglutaryl-coenzyme A reductase
Ligand
BDBM50009729
Substrate
Meas. Tech.
ChEMBL_1343944 (CHEMBL3259253)
IC50
260000±n/a nM
Citation
 Dygos, JHJett, CMChinn, LJMiller, JE Hypolipidemic activity of 5-aryl-3-methylvaleric acid derivatives. J Med Chem 20:1705-8 (1978)  
Target
Name:
3-hydroxy-3-methylglutaryl-coenzyme A reductase
Synonyms:
HMDH_RAT Hmgcr
Type:
Enzyme
Mol. Mass.:
96689.85
Organism:
Rattus norvegicus (rat)
Description:
Isolated rat liver microsomes were used as enzyme source.
Residue:
887
  
Inhibitor
Name:
BDBM50009729
Synonyms:
CHEMBL3246896
Type:
Small organic molecule
Emp. Form.:
C18H16O4
Mol. Mass.:
296.3172
SMILES:
CC(CC(O)=O)CC(=O)c1ccc2oc3ccccc3c2c1
: